Target
Beta-2 adrenergic receptor
Ligand
BDBM50213112
Substrate
Meas. Tech.
ChEMBL_436827 (CHEMBL905129)
Ki
7900±n/a nM
Citation
 Jozwiak, KKhalid, CTanga, MJBerzetei-Gurske, IJimenez, LKozocas, JAWoo, AZhu, WXiao, RPAbernethy, DRWainer, IW Comparative molecular field analysis of the binding of the stereoisomers of fenoterol and fenoterol derivatives to the beta2 adrenergic receptor. J Med Chem 50:2903-15 (2007)  
Target
Name:
Beta-2 adrenergic receptor
Synonyms:
ADRB2 ADRB2_HUMAN Beta-2 adrenoceptor | Beta-2 adrenoreceptor
Type:
Mol. Mass.:
46461.69
Organism:
Homo sapiens (Human)
Description:
P07550
Residue:
413
  
Inhibitor
Name:
BDBM50213112
Synonyms:
(R,S)-(-)-5-{2-[2-(4-aminophenyl)-1-methylethylamino]-1-hydroxyethyl}-1,3-benzenediol US10617654, Compound (R,S)-3 US9492405, 10
Type:
Small organic molecule
Emp. Form.:
C17H21NO3
Mol. Mass.:
287.3535
SMILES:
C[C@@H](Cc1ccccc1)NC[C@H](O)c1cc(O)cc(O)c1
: