Target
Beta-2 adrenergic receptor
Ligand
BDBM50213119
Substrate
Meas. Tech.
ChEMBL_436827 (CHEMBL905129)
Ki
10500±n/a nM
Citation
 Jozwiak, KKhalid, CTanga, MJBerzetei-Gurske, IJimenez, LKozocas, JAWoo, AZhu, WXiao, RPAbernethy, DRWainer, IW Comparative molecular field analysis of the binding of the stereoisomers of fenoterol and fenoterol derivatives to the beta2 adrenergic receptor. J Med Chem 50:2903-15 (2007)  
Target
Name:
Beta-2 adrenergic receptor
Synonyms:
ADRB2 ADRB2_HUMAN Beta-2 adrenoceptor | Beta-2 adrenoreceptor
Type:
Mol. Mass.:
46461.69
Organism:
Homo sapiens (Human)
Description:
P07550
Residue:
413
  
Inhibitor
Name:
BDBM50213119
Synonyms:
(R)-(-)-5-(1-hydroxy-2-phenethylaminoethyl)-1,3-benzenediol US10617654, Compound (R)-7 US9492405, (R)-7 | US9492405, 25
Type:
Small organic molecule
Emp. Form.:
C16H19NO3
Mol. Mass.:
273.327
SMILES:
O[C@@H](CNCCc1ccccc1)c1cc(O)cc(O)c1
: