Target
Kinesin-like protein KIF11
Ligand
BDBM23823
Substrate
Meas. Tech.
ChEMBL_447486 (CHEMBL896510)
IC50
150±n/a nM
Citation
 Ogo, NOishi, SMatsuno, KSawada, JFujii, NAsai, A Synthesis and biological evaluation of L-cysteine derivatives as mitotic kinesin Eg5 inhibitors. Bioorg Med Chem Lett 17:3921-4 (2007)  
Target
Name:
Kinesin-like protein KIF11
Synonyms:
EG5 KIF11_HUMAN Kinesin Spindle Protein Eg5 TRIP5 | kinesin spindle protein
Type:
PROTEIN
Mol. Mass.:
119138.97
Organism:
Homo sapiens (Human)
Description:
ChEMBL_1457426
Residue:
1056
  
Inhibitor
Name:
BDBM23823
Synonyms:
(2R)-2-amino-3-{[(4-methoxyphenyl)diphenylmethyl]sulfanyl}propanoic acid S-Trityl-L-Cysteine (STLC) Analogue, 52
Type:
Small organic molecule
Emp. Form.:
C23H23NO3S
Mol. Mass.:
393.499
SMILES:
COc1ccc(cc1)C(SC[C@H](N)C(O)=O)(c1ccccc1)c1ccccc1
: