Target
C-X-C chemokine receptor type 1
Ligand
BDBM50213750
Substrate
Meas. Tech.
ChEMBL_447495 (CHEMBL896518)
IC50
3200±n/a nM
Citation
 Wang, YBusch-Petersen, JWang, FMa, LFu, WKerns, JKJin, JPalovich, MRShen, JKBurman, MFoley, JJSchmidt, DBHunsberger, GESarau, HMWiddowson, KL 3-Arylamino-2H-1,2,4-benzothiadiazin-5-ol 1,1-dioxides as novel and selective CXCR2 antagonists. Bioorg Med Chem Lett 17:3864-7 (2007)  
Target
Name:
C-X-C chemokine receptor type 1
Synonyms:
C-X-C chemokine receptor type 1 (CXCR-1) CMKAR1 CXCR1_HUMAN Interleukin-8 receptor A | Interleukin-8 receptors, CXCR1/CXCR2
Type:
Enzyme
Mol. Mass.:
39803.83
Organism:
Homo sapiens (Human)
Description:
P25024
Residue:
350
  
Inhibitor
Name:
BDBM50213750
Synonyms:
3-(2-bromo-phenylamino)-7-nitro-1,1-dioxo-1,4-dihydro-1lambda6-benzo[1,2,4]thiadiazin-5-ol | CHEMBL443583
Type:
Small organic molecule
Emp. Form.:
C13H9BrN4O5S
Mol. Mass.:
413.203
SMILES:
Oc1cc(cc2c1N=C(Nc1ccccc1Br)NS2(=O)=O)[N+]([O-])=O
: