Target
Cannabinoid receptor 2
Ligand
BDBM50213881
Substrate
Meas. Tech.
ChEMBL_447525 (CHEMBL895424)
Ki
0.8±n/a nM
Citation
 Kai, HMorioka, YTomida, MTakahashi, THattori, MHanasaki, KKoike, KChiba, HShinohara, SKanemasa, TIwamoto, YTakahashi, KYamaguchi, YBaba, TYoshikawa, TTakenaka, H 2-Arylimino-5,6-dihydro-4H-1,3-thiazines as a new class of cannabinoid receptor agonists. Part 2: orally bioavailable compounds. Bioorg Med Chem Lett 17:3925-9 (2007)  
Target
Name:
Cannabinoid receptor 2
Synonyms:
CANNABINOID CB2 CB2 CB2B CNR2_HUMAN Cannabinoid CB2 receptor Cannabinoid receptor 2 (CB2R) | hCB2
Type:
G Protein-Coupled Receptor (GPCR)
Mol. Mass.:
39690.94
Organism:
Homo sapiens (Human)
Description:
P34972
Residue:
360
  
Inhibitor
Name:
BDBM50213881
Synonyms:
3-[(Z)-2-isopropyl-phenylimino]-2-thia-4-aza-spiro[5.5]undecane-4-carbodithioic acid methyl ester | CHEMBL443842
Type:
Small organic molecule
Emp. Form.:
C20H28N2S3
Mol. Mass.:
392.645
SMILES:
CSC(=S)N1CC2(CCCCC2)CS\C1=N/c1ccccc1C(C)C
: