Target
Beta-3 adrenergic receptor
Ligand
BDBM50214233
Substrate
Meas. Tech.
ChEMBL_456291 (CHEMBL888301)
Ki
19±n/a nM
Citation
 Washburn, WNHarper, TWWu, GGodfrey, JDMcCann, PGirotra, RShao, CZhang, HGavai, AMikkilineni, ADejneka, TAhmed, SCaringal, YHangeland, JZhang, MCheng, PTRussell, ADSkwish, SSlusarchyk, DAAllen, GTFrohlich, BHAbboa-Offei, BECap, MWaldron, TLGeorge, RJTesfamariam, BDickinson, KESeymour, AASher, PM Arylpropanolamines: selective beta3 agonists arising from strategies to mitigate phase I metabolic transformations. Bioorg Med Chem Lett 17:4290-6 (2007)  
Target
Name:
Beta-3 adrenergic receptor
Synonyms:
ADRB3 ADRB3_HUMAN Beta-2 adrenergic receptor and beta-3 adrenergic receptor Beta-3 adrenoreceptor | adrenergic Beta3
Type:
G Protein-Coupled Receptor (GPCR)
Mol. Mass.:
43534.88
Organism:
Homo sapiens (Human)
Description:
Residue:
408
  
Inhibitor
Name:
BDBM50214233
Synonyms:
CHEMBL250553 | N-(5-((S)-3-((R)-1-(3,4-bis(difluoromethoxy)phenyl)-2-phenylethylamino)-2-hydroxypropyl)-2-hydroxyphenyl)methanesulfonamide
Type:
Small organic molecule
Emp. Form.:
C26H28F4N2O6S
Mol. Mass.:
572.569
SMILES:
CS(=O)(=O)Nc1cc(C[C@H](O)CN[C@H](Cc2ccccc2)c2ccc(OC(F)F)c(OC(F)F)c2)ccc1O
: