Target
Free fatty acid receptor 1
Ligand
BDBM22496
Substrate
Meas. Tech.
ChEMBL_439195 (CHEMBL889543)
EC50
17800±n/a nM
Citation
 Tikhonova, IGSum, CSNeumann, SThomas, CJRaaka, BMCostanzi, SGershengorn, MC Bidirectional, iterative approach to the structural delineation of the functional"chemoprint" in GPR40 for agonist recognition. J Med Chem 50:2981-9 (2007)  
Target
Name:
Free fatty acid receptor 1
Synonyms:
FFAR1 G-protein Coupled Receptor 40 | GPR40
Type:
G Protein-Coupled Receptor (GPCR)
Mol. Mass.:
31473.32
Organism:
Homo sapiens (Human)
Description:
O14842
Residue:
300
  
Inhibitor
Name:
BDBM22496
Synonyms:
3-(4-{[(3-phenoxyphenyl)methyl]amino}phenyl)propanoic acid carboxylic acid agonist, 2
Type:
Small organic molecule
Emp. Form.:
C22H21NO3
Mol. Mass.:
347.407
SMILES:
OC(=O)CCc1ccc(NCc2cccc(Oc3ccccc3)c2)cc1
: