Target
Adenosine receptor A3
Ligand
BDBM50214979
Substrate
Meas. Tech.
ChEMBL_439361 (CHEMBL888475)
Ki
8.99±n/a nM
Citation
 Jeong, LSChoe, SAGunaga, PKim, HOLee, HWLee, SKTosh, DKPatel, APalaniappan, KKGao, ZGJacobson, KAMoon, HR Discovery of a new nucleoside template for human A3 adenosine receptor ligands: D-4'-thioadenosine derivatives without 4'-hydroxymethyl group as highly potent and selective antagonists. J Med Chem 50:3159-62 (2007)  
Target
Name:
Adenosine receptor A3
Synonyms:
A3 adenosine receptor (hA3) ADORA3 | Adenosine A3 receptor (A3AR)
Type:
G Protein-Coupled Receptor (GPCR)
Mol. Mass.:
36197.32
Organism:
Homo sapiens (Human)
Description:
P0DMS8
Residue:
318
  
Inhibitor
Name:
BDBM50214979
Synonyms:
(2R,3R,4S)-2-(6-(3-bromobenzylamino)-2-chloro-9H-purin-9-yl)-tetrahydrothiophene-3,4-diol CHEMBL226585
Type:
Small organic molecule
Emp. Form.:
C16H15BrClN5O2S
Mol. Mass.:
456.745
SMILES:
O[C@@H]1CS[C@H]([C@@H]1O)n1cnc2c(NCc3cccc(Br)c3)nc(Cl)nc12
: