Target
Adenosine receptor A3
Ligand
BDBM50214982
Substrate
Meas. Tech.
ChEMBL_439361 (CHEMBL888475)
Ki
24.8±n/a nM
Citation
 Jeong, LSChoe, SAGunaga, PKim, HOLee, HWLee, SKTosh, DKPatel, APalaniappan, KKGao, ZGJacobson, KAMoon, HR Discovery of a new nucleoside template for human A3 adenosine receptor ligands: D-4'-thioadenosine derivatives without 4'-hydroxymethyl group as highly potent and selective antagonists. J Med Chem 50:3159-62 (2007)  
Target
Name:
Adenosine receptor A3
Synonyms:
A3 adenosine receptor (hA3) ADORA3 | Adenosine A3 receptor (A3AR)
Type:
G Protein-Coupled Receptor (GPCR)
Mol. Mass.:
36197.32
Organism:
Homo sapiens (Human)
Description:
P0DMS8
Residue:
318
  
Inhibitor
Name:
BDBM50214982
Synonyms:
(2R,3R,4S)-2-(2-chloro-6-(naphthalen-1-ylmethylamino)-9H-purin-9-yl)tetrahydrothiophene-3,4-diol | CHEMBL389912
Type:
Small organic molecule
Emp. Form.:
C20H18ClN5O2S
Mol. Mass.:
427.907
SMILES:
O[C@@H]1CS[C@H]([C@@H]1O)n1cnc2c(NCc3cccc4ccccc34)nc(Cl)nc12
: