Target
Coagulation factor X
Ligand
BDBM50214995
Substrate
Meas. Tech.
ChEMBL_456376 (CHEMBL906423)
IC50
16±n/a nM
Citation
 Nagata, TYoshino, THaginoya, NYoshikawa, KIsobe, YFurugohri, TKanno, H Cycloalkanediamine derivatives as novel blood coagulation factor Xa inhibitors. Bioorg Med Chem Lett 17:4683-8 (2007)  
Target
Name:
Coagulation factor X
Synonyms:
Activated coagulation factor X (FXa) Coagulation factor X precursor F10 Factor X heavy chain Factor Xa Stuart-Prower factor
Type:
Enzyme
Mol. Mass.:
54726.60
Organism:
Homo sapiens (Human)
Description:
Residue:
488
  
Inhibitor
Name:
BDBM50214995
Synonyms:
CHEMBL245678 cis-N-(2-(5-chloro-1H-indole-2-carboxamido)cyclohexyl)-5-methyl-4,5,6,7-tetrahydrothiazolo[5,4-c]pyridine-2-carboxamide
Type:
Small organic molecule
Emp. Form.:
C23H26ClN5O2S
Mol. Mass.:
472.003
SMILES:
CN1CCc2nc(sc2C1)C(=O)N[C@@H]1CCCC[C@@H]1NC(=O)c1cc2cc(Cl)ccc2[nH]1
: