Target
Small conductance calcium-activated potassium channel protein 3
Ligand
BDBM50215069
Substrate
Meas. Tech.
ChEMBL_437153 (CHEMBL906550)
IC50
86±n/a nM
Citation
 Fletcher, DIGanellin, CRPiergentili, ADunn, PMJenkinson, DH Synthesis and pharmacological testing of polyaminoquinolines as blockers of the apamin-sensitive Ca2+-activated K+ channel (SK(Ca)). Bioorg Med Chem 15:5457-79 (2007)  
Target
Name:
Small conductance calcium-activated potassium channel protein 3
Synonyms:
KCNN3_RAT SK3 | Small conductance calcium-activated potassium channel
Type:
PROTEIN
Mol. Mass.:
81476.29
Organism:
Rattus norvegicus
Description:
ChEMBL_494975
Residue:
732
  
Inhibitor
Name:
BDBM50215069
Synonyms:
1,2,3-tris-[3-(4-(N-ethyl)-quinoliniumylamino)-propoxy]-benzene | CHEMBL229216
Type:
Small organic molecule
Emp. Form.:
C48H57N6O3
Mol. Mass.:
766.0029
SMILES:
CCn1cc\c(=[NH+]\CCCOc2cccc(OCCCNc3cc[n+](CC)c4ccccc34)c2OCCC\[NH+]=c2/ccn(CC)c3ccccc23)c2ccccc12
: