Target
Coagulation factor VII
Ligand
BDBM50215433
Substrate
Meas. Tech.
ChEMBL_439443 (CHEMBL888563)
IC50
40±n/a nM
Citation
 Trujillo, JIHuang, HCNeumann, WLMahoney, MWLong, SHuang, WGarland, DJKusturin, CAbbas, ZSouth, MSReitz, DB Design, synthesis, and biological evaluation of pyrazinones containing novel P1 needles as inhibitors of TF/VIIa. Bioorg Med Chem Lett 17:4568-74 (2007)  
Target
Name:
Coagulation factor VII
Synonyms:
Eptacog alfa FA7_HUMAN Factor VIIa (fVIIa) SPCA serum prothrombin conversion accelerator
Type:
Enzyme
Mol. Mass.:
51599.89
Organism:
Homo sapiens (Human)
Description:
Residue:
466
  
Inhibitor
Name:
BDBM50215433
Synonyms:
2-[6-(3-aminophenyl)-5-chloro-3-(cyclobutylamino)-2-oxo-1,2-dihydropyrazin-1-yl]-N-[(4-carbamimidoyl-2-fluorophenyl)methyl]acetamide | CHEMBL390663
Type:
Small organic molecule
Emp. Form.:
C24H25ClFN7O2
Mol. Mass.:
497.952
SMILES:
NC(=N)c1ccc(CNC(=O)Cn2c(c(Cl)nc(NC3CCC3)c2=O)-c2cccc(N)c2)c(F)c1
: