Target
Coagulation factor VII
Ligand
BDBM50215422
Substrate
Meas. Tech.
ChEMBL_439443 (CHEMBL888563)
IC50
12500±n/a nM
Citation
 Trujillo, JIHuang, HCNeumann, WLMahoney, MWLong, SHuang, WGarland, DJKusturin, CAbbas, ZSouth, MSReitz, DB Design, synthesis, and biological evaluation of pyrazinones containing novel P1 needles as inhibitors of TF/VIIa. Bioorg Med Chem Lett 17:4568-74 (2007)  
Target
Name:
Coagulation factor VII
Synonyms:
Eptacog alfa FA7_HUMAN Factor VIIa (fVIIa) SPCA serum prothrombin conversion accelerator
Type:
Enzyme
Mol. Mass.:
51599.89
Organism:
Homo sapiens (Human)
Description:
Residue:
466
  
Inhibitor
Name:
BDBM50215422
Synonyms:
CHEMBL243107 | N-(4-(4,5-dihydro-1H-imidazol-2-yl)benzyl)-2-(6-(3-aminophenyl)-5-chloro-3-(cyclobutylamino)-2-oxopyrazin-1(2H)-yl)acetamide
Type:
Small organic molecule
Emp. Form.:
C26H28ClN7O2
Mol. Mass.:
505.999
SMILES:
Nc1cccc(c1)-c1c(Cl)nc(NC2CCC2)c(=O)n1CC(=O)NCc1ccc(cc1)C1=NCCN1
: