Target
Coagulation factor VII
Ligand
BDBM50215438
Substrate
Meas. Tech.
ChEMBL_439443 (CHEMBL888563)
IC50
>30000±n/a nM
Citation
 Trujillo, JIHuang, HCNeumann, WLMahoney, MWLong, SHuang, WGarland, DJKusturin, CAbbas, ZSouth, MSReitz, DB Design, synthesis, and biological evaluation of pyrazinones containing novel P1 needles as inhibitors of TF/VIIa. Bioorg Med Chem Lett 17:4568-74 (2007)  
Target
Name:
Coagulation factor VII
Synonyms:
Eptacog alfa FA7_HUMAN Factor VIIa (fVIIa) SPCA serum prothrombin conversion accelerator
Type:
Enzyme
Mol. Mass.:
51599.89
Organism:
Homo sapiens (Human)
Description:
Residue:
466
  
Inhibitor
Name:
BDBM50215438
Synonyms:
(E)-N-((5-amino-2,3-dihydrobenzo[f][1,4]thiazepin-8-yl)methyl)-2-(6-(3-aminophenyl)-5-chloro-3-(cyclobutylamino)-2-oxopyrazin-1(2H)-yl)acetamide | CHEMBL388438
Type:
Small organic molecule
Emp. Form.:
C26H28ClN7O2S
Mol. Mass.:
538.064
SMILES:
Nc1cccc(c1)-c1c(Cl)nc(NC2CCC2)c(=O)n1CC(=O)NCc1ccc2c(SCCN=C2N)c1
: