Target
Dihydrofolate reductase
Ligand
BDBM18069
Substrate
Meas. Tech.
ChEMBL_439550 (CHEMBL888666)
IC50
133000±n/a nM
Citation
 Reynolds, RCCampbell, SRFairchild, RGKisliuk, RLMicca, PLQueener, SFRiordan, JMSedwick, WDWaud, WRLeung, AKDixon, RWSuling, WJBorhani, DW Novel boron-containing, nonclassical antifolates: synthesis and preliminary biological and structural evaluation. J Med Chem 50:3283-9 (2007)  
Target
Name:
Dihydrofolate reductase
Synonyms:
DYR_RAT Dihydrofolate reductase (DHFR) Tetrahydrofolate dehydrogenase
Type:
Enzyme
Mol. Mass.:
21638.84
Organism:
Rattus norvegicus (rat)
Description:
Residue:
187
  
Inhibitor
Name:
BDBM18069
Synonyms:
5-[(3,4,5-trimethoxyphenyl)methyl]pyrimidine-2,4-diamine TMP Trimethoprim (TMP) | US10870625, Compound TMP
Type:
Small organic molecule
Emp. Form.:
C14H18N4O3
Mol. Mass.:
290.3177
SMILES:
COc1cc(Cc2cnc(N)nc2N)cc(OC)c1OC
: