Target
D(2) dopamine receptor
Ligand
BDBM50216045
Substrate
Meas. Tech.
ChEMBL_448363 (CHEMBL898624)
Ki
4.1±n/a nM
Citation
 Awadallah, FMMüller, FLehmann, JAbadi, AH Synthesis of novel lactam derivatives and their evaluation as ligands for the dopamine receptors, leading to a D(4)-selective ligand. Bioorg Med Chem 15:5811-8 (2007)  
Target
Name:
D(2) dopamine receptor
Synonyms:
D(2) dopamine receptor DOPAMINE D2 Long DRD2 Dopamine D2 receptor Dopamine D2 receptor (D2R) Dopamine2-like | d2
Type:
Cell-surface receptors
Mol. Mass.:
50647.10
Organism:
Homo sapiens (Human)
Description:
P14416
Residue:
443
  
Inhibitor
Name:
BDBM50216045
Synonyms:
2-(4-(4-(2-methoxyphenyl)-1-piperazinyl)butyl)-1,2-benzisothiazole-3(2H)-one 1,1-dioxide | CHEMBL394110
Type:
Small organic molecule
Emp. Form.:
C21H25N3O3S
Mol. Mass.:
399.507
SMILES:
O=C1N(CCCCN2CCN(CC2)c2ccccc2)S(=O)(=O)c2ccccc12
: