Target
Beta-3 adrenergic receptor
Ligand
BDBM50218164
Substrate
Meas. Tech.
ChEMBL_457035 (CHEMBL924399)
EC50
13±n/a nM
Citation
 Lafontaine, JADay, RFDibrino, JHadcock, JRHargrove, DMLinhares, MMartin, KAMaurer, TSNardone, NATess, DADasilva-Jardine, P Discovery of potent and orally bioavailable heterocycle-based beta3-adrenergic receptor agonists, potential therapeutics for the treatment of obesity. Bioorg Med Chem Lett 17:5245-50 (2007)  
Target
Name:
Beta-3 adrenergic receptor
Synonyms:
ADRB3_RAT Adrb3r Beta-3 adrenergic receptor
Type:
PROTEIN
Mol. Mass.:
43161.83
Organism:
Rattus norvegicus
Description:
ChEMBL_1509452
Residue:
400
  
Inhibitor
Name:
BDBM50218164
Synonyms:
(R)-2-(2-(4-(2-methylthiazol-4-yl)phenoxy)ethylamino)-1-(pyridin-3-yl)ethanol | CHEMBL251599
Type:
Small organic molecule
Emp. Form.:
C19H21N3O2S
Mol. Mass.:
355.454
SMILES:
Cc1nc(cs1)-c1ccc(OCCNC[C@H](O)c2cccnc2)cc1
: