Target
Adenosine receptor A1
Ligand
BDBM50218916
Substrate
Meas. Tech.
ChEMBL_445194 (CHEMBL894342)
Ki
32±n/a nM
Citation
 Colotta, VCatarzi, DVarano, FCapelli, FLenzi, OFilacchioni, GMartini, CTrincavelli, LCiampi, OPugliese, AMPedata, FSchiesaro, AMorizzo, EMoro, S New 2-arylpyrazolo[3,4-c]quinoline derivatives as potent and selective human A3 adenosine receptor antagonists. Synthesis, pharmacological evaluation, and ligand-receptor modeling studies. J Med Chem 50:4061-74 (2007)  
Target
Name:
Adenosine receptor A1
Synonyms:
A1 adenosine receptor (hA1) AA1R_HUMAN ADORA1 Adenosine A1-receptor Adenosine receptor A1 (hA1) | Adenosine transporter (AdT)
Type:
G Protein-Coupled Receptor (GPCR)
Mol. Mass.:
36520.92
Organism:
Homo sapiens (Human)
Description:
P30542
Residue:
326
  
Inhibitor
Name:
BDBM50218916
Synonyms:
2-(3-methoxyphenyl)-2H-pyrazolo[3,4-c]quinolin-4-amine | CHEMBL388458
Type:
Small organic molecule
Emp. Form.:
C17H14N4O
Mol. Mass.:
290.3193
SMILES:
COc1cccc(c1)-n1cc2c(n1)c(N)nc1ccccc21
: