Target
D(2) dopamine receptor
Ligand
BDBM50161214
Substrate
Meas. Tech.
ChEMBL_445356 (CHEMBL895648)
Ki
93.3±n/a nM
Citation
 Grundt, PPrevatt, KMCao, JTaylor, MFloresca, CZChoi, JKJenkins, BGLuedtke, RRNewman, AH Heterocyclic analogues of N-(4-(4-(2,3-dichlorophenyl)piperazin-1-yl)butyl)arylcarboxamides with functionalized linking chains as novel dopamine D3 receptor ligands: potential substance abuse therapeutic agents. J Med Chem 50:4135-46 (2007)  
Target
Name:
D(2) dopamine receptor
Synonyms:
D(2) dopamine receptor DOPAMINE D2 Long DRD2 Dopamine D2 receptor Dopamine D2 receptor (D2R) Dopamine2-like | d2
Type:
Cell-surface receptors
Mol. Mass.:
50647.10
Organism:
Homo sapiens (Human)
Description:
P14416
Residue:
443
  
Inhibitor
Name:
BDBM50161214
Synonyms:
CHEMBL180010 N-{4-[4-(2,3-Dichloro-phenyl)-piperazin-1-yl]-but-2-enyl}-4-pyridin-2-yl-benzamide | PG-01037
Type:
Small organic molecule
Emp. Form.:
C26H26Cl2N4O
Mol. Mass.:
481.417
SMILES:
Clc1cccc(N2CCN(C\C=C\CNC(=O)c3ccc(cc3)-c3ccccn3)CC2)c1Cl
: