Target
D(3) dopamine receptor
Ligand
BDBM50178623
Substrate
Meas. Tech.
ChEMBL_445357 (CHEMBL894567)
Ki
0.3±n/a nM
Citation
 Grundt, PPrevatt, KMCao, JTaylor, MFloresca, CZChoi, JKJenkins, BGLuedtke, RRNewman, AH Heterocyclic analogues of N-(4-(4-(2,3-dichlorophenyl)piperazin-1-yl)butyl)arylcarboxamides with functionalized linking chains as novel dopamine D3 receptor ligands: potential substance abuse therapeutic agents. J Med Chem 50:4135-46 (2007)  
Target
Name:
D(3) dopamine receptor
Synonyms:
DOPAMINE D3 DRD3_HUMAN Dopamine D3 receptor (D3) Dopamine receptor Dopamine receptor D3
Type:
Mol. Mass.:
44243.43
Organism:
Homo sapiens (Human)
Description:
Residue:
400
  
Inhibitor
Name:
BDBM50178623
Synonyms:
CHEMBL110365 | N-(4-(4-(2-methoxyphenyl)piperazin-1-yl)butyl)-9H-fluorene-2-carboxamide
Type:
Small organic molecule
Emp. Form.:
C29H33N3O2
Mol. Mass.:
455.5912
SMILES:
COc1ccccc1N1CCN(CCCCNC(=O)c2ccc-3c(Cc4ccccc-34)c2)CC1
: