Target
Sodium-dependent serotonin transporter
Ligand
BDBM50219561
Substrate
Meas. Tech.
ChEMBL_445750 (CHEMBL896041)
Ki
0.08±n/a nM
Citation
 Plisson, CStehouwer, JSVoll, RJHowell, LVotaw, JROwens, MJGoodman, MM Synthesis and in vivo evaluation of fluorine-18 and iodine-123 labeled 2beta-carbo(2-fluoroethoxy)-3beta-(4'-((Z)-2-iodoethenyl)phenyl)nortropane as a candidate serotonin transporter imaging agent. J Med Chem 50:4553-60 (2007)  
Target
Name:
Sodium-dependent serotonin transporter
Synonyms:
5-HT Transporter 5HTT SC6A4_HUMAN SLC6A4 Serotonin transporter (5HTT) Sodium-dependent serotonin transporter (SERT) | Solute carrier family 6 member 4
Type:
Multi-pass membrane protein
Mol. Mass.:
70322.51
Organism:
Homo sapiens (Human)
Description:
P31645
Residue:
630
  
Inhibitor
Name:
BDBM50219561
Synonyms:
2-beta-carbo(2-fluoroethoxy)-3-beta-(4'-((Z)-2-iodoethenyl)phenyl)-nortropane | CHEMBL230000
Type:
Small organic molecule
Emp. Form.:
C18H21FINO2
Mol. Mass.:
429.2677
SMILES:
FCCOC(=O)C1C2CCC(CC1c1ccc(\C=C/I)cc1)N2
: