Target
Kinesin-like protein KIF11
Ligand
BDBM50220195
Substrate
Meas. Tech.
ChEMBL_446063 (CHEMBL895158)
IC50
11±n/a nM
Citation
Target
Name:
Kinesin-like protein KIF11
Synonyms:
EG5 KIF11_HUMAN Kinesin Spindle Protein Eg5 TRIP5 | kinesin spindle protein
Type:
PROTEIN
Mol. Mass.:
119138.97
Organism:
Homo sapiens (Human)
Description:
ChEMBL_1457426
Residue:
1056
  
Inhibitor
Name:
BDBM50220195
Synonyms:
CHEMBL243885 | N-[4'-(trifluoromethyl)-4-biphenylyl]thiourea
Type:
Small organic molecule
Emp. Form.:
C14H11F3N2S
Mol. Mass.:
296.311
SMILES:
NC(=S)Nc1ccc(cc1)-c1ccc(cc1)C(F)(F)F
: