Target
Kinesin-like protein KIF11
Ligand
BDBM50220177
Substrate
Meas. Tech.
ChEMBL_446063 (CHEMBL895158)
IC50
58±n/a nM
Citation
Target
Name:
Kinesin-like protein KIF11
Synonyms:
EG5 KIF11_HUMAN Kinesin Spindle Protein Eg5 TRIP5 | kinesin spindle protein
Type:
PROTEIN
Mol. Mass.:
119138.97
Organism:
Homo sapiens (Human)
Description:
ChEMBL_1457426
Residue:
1056
  
Inhibitor
Name:
BDBM50220177
Synonyms:
CHEMBL389588 | N-{4'-[(trifluoromethyl)sulfonyl]-4-biphenyl}urea
Type:
Small organic molecule
Emp. Form.:
C14H11F3N2O3S
Mol. Mass.:
344.309
SMILES:
NC(=O)Nc1ccc(cc1)-c1ccc(cc1)S(=O)(=O)C(F)(F)F
: