Target
Histone deacetylase 1
Ligand
BDBM50220235
Substrate
Meas. Tech.
ChEMBL_449159 (CHEMBL899424)
IC50
75±n/a nM
Citation
 Hamblett, CLMethot, JLMampreian, DMSloman, DLStanton, MGKral, AMFleming, JCCruz, JCChenard, MOzerova, NHitz, AMWang, HDeshmukh, SVNazef, NHarsch, AHughes, BDahlberg, WKSzewczak, AAMiddleton, REMosley, RTSecrist, JPMiller, TA The discovery of 6-amino nicotinamides as potent and selective histone deacetylase inhibitors. Bioorg Med Chem Lett 17:5300-9 (2007)  
Target
Name:
Histone deacetylase 1
Synonyms:
Cereblon/Histone deacetylase 1 HDAC1 Histone deacetylase 1 (HDAC1) RPD3L1
Type:
Enzyme
Mol. Mass.:
55090.27
Organism:
Homo sapiens (Human)
Description:
Q13547
Residue:
482
  
Inhibitor
Name:
BDBM50220235
Synonyms:
(S)-4-(5-((2-aminophenyl)carbamoyl)pyridin-2-yl)-2-methyl-N-phenylpiperazine-1-carboxamide | CHEMBL237539
Type:
Small organic molecule
Emp. Form.:
C24H26N6O2
Mol. Mass.:
430.5022
SMILES:
C[C@H]1CN(CCN1C(=O)Nc1ccccc1)c1ccc(cn1)C(=O)Nc1ccccc1N
: