Target
Amyloid-beta precursor protein
Ligand
BDBM50220276
Substrate
Meas. Tech.
ChEMBL_449193 (CHEMBL899458)
IC50
104±n/a nM
Citation
 Josien, HBara, TRajagopalan, MAsberom, TClader, JWFavreau, LGreenlee, WJHyde, LANomeir, AAParker, EMPissarnitski, DASong, LWong, GTZhang, LZhang, QZhao, Z Small conformationally restricted piperidine N-arylsulfonamides as orally active gamma-secretase inhibitors. Bioorg Med Chem Lett 17:5330-5 (2007)  
Target
Name:
Amyloid-beta precursor protein
Synonyms:
A4 ABPP AICD-50 AICD-59 AID(57) APP Alzheimer disease amyloid protein Amyloid beta Protein Amyloid beta protein Abeta(1-42) Amyloid intracellular domain 57 Amyloid protein (Abeta42b) Beta amyloid A4 protein Beta-APP42 Beta-amyloid protein 42 C83 CVAP Gamma Secretase Gamma-CTF(57) Gamma-secretase Gamma-secretase C-terminal fragment 57 P3(40) PN-II Protease nexin-II S-APP-beta Soluble APP-beta | beta-Amyloid Precursor Protein (APP)
Type:
Single-pass type I membrane protein
Mol. Mass.:
86890.41
Organism:
Homo sapiens (Human)
Description:
P05067
Residue:
770
  
Inhibitor
Name:
BDBM50220276
Synonyms:
(2S)-9-(4-chlorophenylsulfonyl)-9-aza-bicyclo[3.3.1]nonan-2-yl 4-ethyl-4-hydroxypiperidine-1-carboxylate | CHEMBL236196
Type:
Small organic molecule
Emp. Form.:
C22H31ClN2O5S
Mol. Mass.:
471.01
SMILES:
CCC1(O)CCN(CC1)C(=O)O[C@H]1CCC2CCCC1N2S(=O)(=O)c1ccc(Cl)cc1
: