Target
D(2) dopamine receptor
Ligand
BDBM50007517
Substrate
Meas. Tech.
ChEMBL_457316 (CHEMBL941849)
Ki
1.6±n/a nM
Citation
 Stark, DPiel, MHübner, HGmeiner, PGründer, GRösch, F In vitro affinities of various halogenated benzamide derivatives as potential radioligands for non-invasive quantification of D(2)-like dopamine receptors. Bioorg Med Chem 15:6819-29 (2007)  
Target
Name:
D(2) dopamine receptor
Synonyms:
D(2) dopamine receptor DOPAMINE D2 Long DRD2 Dopamine D2 receptor Dopamine D2 receptor (D2R) Dopamine2-like | d2
Type:
Cell-surface receptors
Mol. Mass.:
50647.10
Organism:
Homo sapiens (Human)
Description:
P14416
Residue:
443
  
Inhibitor
Name:
BDBM50007517
Synonyms:
(S)-3-bromo-N-((1-ethylpyrrolidin-2-yl)methyl)-2-hydroxy-5,6-dimethoxybenzamide CHEMBL76402
Type:
Small organic molecule
Emp. Form.:
C16H23BrN2O4
Mol. Mass.:
387.269
SMILES:
CCN1CCC[C@H]1CNC(=O)c1c(O)c(Br)cc(OC)c1OC
: