Target
5-hydroxytryptamine receptor 1A
Ligand
BDBM50220910
Substrate
Meas. Tech.
ChEMBL_449378 (CHEMBL899647)
Ki
1.3±n/a nM
Citation
 Krushinski, JHSchaus, JMThompson, DCCalligaro, DONelson, DLLuecke, SHWainscott, DBWong, DT Indoloxypropanolamine analogues as 5-HT(1A) receptor antagonists. Bioorg Med Chem Lett 17:5600-4 (2007)  
Target
Name:
5-hydroxytryptamine receptor 1A
Synonyms:
5-HT-1A 5-hydroxytryptamine receptor 1A (5-HT-1A) ADRB2RL1 Dopamine D2 receptor and serotonin 1a receptor HTR1A | Serotonin receptor 1A
Type:
Mol. Mass.:
46122.49
Organism:
Homo sapiens (Human)
Description:
Residue:
422
  
Inhibitor
Name:
BDBM50220910
Synonyms:
(S)-1-(1H-indol-4-yloxy)-3-(cyclohexylamino)propan-2-ol | CHEMBL393648
Type:
Small organic molecule
Emp. Form.:
C17H24N2O2
Mol. Mass.:
288.3847
SMILES:
O[C@@H](CNC1CCCCC1)COc1cccc2[nH]ccc12
: