Target
Androgen receptor
Ligand
BDBM50220943
Substrate
Meas. Tech.
ChEMBL_449393 (CHEMBL899661)
IC50
660±n/a nM
Citation
 Tachibana, KImaoka, IYoshino, HKato, NNakamura, MOhta, MKawata, HTaniguchi, KIshikura, NNagamuta, MOnuma, ESato, H Discovery and structure-activity relationships of new steroidal compounds bearing a carboxy-terminal side chain as androgen receptor pure antagonists. Bioorg Med Chem Lett 17:5573-6 (2007)  
Target
Name:
Androgen receptor
Synonyms:
ANDR_HUMAN Androgen Receptor Androgen receptor/Baculoviral IAP repeat-containing protein 2 Dihydrotestosterone receptor Nuclear receptor subfamily 3 group C member 4
Type:
Receptor
Mol. Mass.:
99185.27
Organism:
Homo sapiens (Human)
Description:
CHO cells were stably transfected with human AR gene.
Residue:
920
  
Inhibitor
Name:
BDBM50220943
Synonyms:
4-(4-(3-((7R,8R,9S,10R,13S,14S,17S)-17-hydroxy-10,13,17-trimethyl-3-oxo-2,3,6,7,8,9,10,11,12,13,14,15,16,17-tetradecahydro-1H-cyclopenta[a]phenanthren-7-yl)propyl)phenoxy)butanoic acid | CHEMBL428021
Type:
Small organic molecule
Emp. Form.:
C33H46O5
Mol. Mass.:
522.7153
SMILES:
C[C@]1(O)CC[C@H]2[C@@H]3[C@H](CCCc4ccc(OCCCC(O)=O)cc4)CC4=CC(=O)CC[C@]4(C)[C@H]3CC[C@]12C
: