Target
Androgen receptor
Ligand
BDBM25437
Substrate
Meas. Tech.
ChEMBL_457595 (CHEMBL923796)
IC50
60±n/a nM
Citation
 Hu, LYDu, DHoffman, JSmith, YFedij, VKostlan, CJohnson, TRHuang, YKesten, SHarter, WYue, WSLi, JJBarvian, NMitchell, LLei, HJLefker, BCarroll, MDettling, DKrieger-Burke, TSamas, BYalamanchili, RLapham, KPocalyko, DSliskovic, DCiotti, SStoller, BHena, MADing, QMaiti, SNStier, MWelgus, H (1R,2S)-4-(2-cyano-cyclohexyl-oxy)-2-trifluoromethyl-benzonitrile, a potent androgen receptor antagonist for stimulating hair growth and reducing sebum production. Bioorg Med Chem Lett 17:5983-8 (2007)  
Target
Name:
Androgen receptor
Synonyms:
ANDR_HUMAN Androgen Receptor Androgen receptor/Baculoviral IAP repeat-containing protein 2 Dihydrotestosterone receptor Nuclear receptor subfamily 3 group C member 4
Type:
Receptor
Mol. Mass.:
99185.27
Organism:
Homo sapiens (Human)
Description:
CHO cells were stably transfected with human AR gene.
Residue:
920
  
Inhibitor
Name:
BDBM25437
Synonyms:
(trifluoromethyl)benzonitrile, 14 CHEMBL399887
Type:
Small organic molecule
Emp. Form.:
C15H13F3N2O
Mol. Mass.:
294.2717
SMILES:
FC(F)(F)c1cc(O[C@@H]2CCCC[C@H]2C#N)ccc1C#N
: