Target
Proto-oncogene tyrosine-protein kinase Src
Ligand
BDBM50221517
Substrate
Meas. Tech.
ChEMBL_457650 (CHEMBL923927)
Ki
110±n/a nM
Citation
 Pannala, MKher, SWilson, NGaudette, JSircar, IZhang, SHBakhirev, AYang, GYuen, PGorcsan, FSakurai, NBarbosa, MCheng, JF Synthesis and structure-activity relationship of 4-(2-aryl-cyclopropylamino)-quinoline-3-carbonitriles as EGFR tyrosine kinase inhibitors. Bioorg Med Chem Lett 17:5978-82 (2007)  
Target
Name:
Proto-oncogene tyrosine-protein kinase Src
Synonyms:
Calmodulin/Proto-oncogene tyrosine-protein kinase Src Proto-oncogene c-Src SRC SRC_HUMAN V-src sarcoma (Schmidt-Ruppin A-2) viral oncogene homolog (avian) p60-Src | pp60c-src
Type:
Protein
Mol. Mass.:
59838.60
Organism:
Homo sapiens (Human)
Description:
P12931
Residue:
536
  
Inhibitor
Name:
BDBM50221517
Synonyms:
6-methoxy-7-(2-methoxyethoxy)-4-((1R,2S)-2-phenylcyclopropylamino)quinoline-3-carbonitrile | CHEMBL401251
Type:
Small organic molecule
Emp. Form.:
C23H23N3O3
Mol. Mass.:
389.447
SMILES:
COCCOc1cc2ncc(C#N)c(N[C@@H]3C[C@H]3c3ccccc3)c2cc1OC
: