Target
Epidermal growth factor receptor
Ligand
BDBM50221525
Substrate
Meas. Tech.
ChEMBL_457644 (CHEMBL923921)
Ki
400±n/a nM
Citation
 Pannala, MKher, SWilson, NGaudette, JSircar, IZhang, SHBakhirev, AYang, GYuen, PGorcsan, FSakurai, NBarbosa, MCheng, JF Synthesis and structure-activity relationship of 4-(2-aryl-cyclopropylamino)-quinoline-3-carbonitriles as EGFR tyrosine kinase inhibitors. Bioorg Med Chem Lett 17:5978-82 (2007)  
Target
Name:
Epidermal growth factor receptor
Synonyms:
EGF Receptor Substrate EGFR_HUMAN ERBB1 Epidermal Growth Factor Receptor erbB-1 Epidermal growth factor receptor (EGFR) HER1 Proto-oncogene c-ErbB-1 Tyrosine-Protein Kinase ErbB-1
Type:
Receptor Kinase Domain
Mol. Mass.:
134279.59
Organism:
Homo sapiens (Human)
Description:
P00533
Residue:
1210
  
Inhibitor
Name:
BDBM50221525
Synonyms:
6-(4-(morpholinomethyl)phenyl)-4-((1R,2S)-2-phenylcyclopropylamino)quinoline-3-carbonitrile | CHEMBL247024
Type:
Small organic molecule
Emp. Form.:
C30H28N4O
Mol. Mass.:
460.5695
SMILES:
N#Cc1cnc2ccc(cc2c1N[C@@H]1C[C@H]1c1ccccc1)-c1ccc(CN2CCOCC2)cc1
: