Target
Potassium voltage-gated channel subfamily H member 2
Ligand
BDBM50411396
Substrate
Meas. Tech.
ChEMBL_446344 (CHEMBL895464)
IC50
79.43±n/a nM
Citation
 Micheli, FBonanomi, GBlaney, FEBraggio, SCapelli, AMChecchia, ACurcuruto, ODamiani, FFabio, RDDonati, DGentile, GGribble, AHamprecht, DTedesco, GTerreni, STarsi, LLightfoot, AStemp, GMacdonald, GSmith, APecoraro, MPetrone, MPerini, OPiner, JRossi, TWorby, APilla, MValerio, EGriffante, CMugnaini, MWood, MScott, CAndreoli, MLacroix, LSchwarz, AGozzi, ABifone, AAshby, CRHagan, JJHeidbreder, C 1,2,4-triazol-3-yl-thiopropyl-tetrahydrobenzazepines: a series of potent and selective dopamine D(3) receptor antagonists. J Med Chem 50:5076-89 (2007)  
Target
Name:
Potassium voltage-gated channel subfamily H member 2
Synonyms:
1,3-beta-glucan synthase component GLS2 ERG Eag-related protein 1 Ether-a-go-go-related gene (HERG) Ether-a-go-go-related gene potassium channel 1 Ether-a-go-go-related gene potassium channel 1 (hERG1) Ether-a-go-go-related protein 1 H-ERG KCNH2 Potassium voltage-gated channel subfamily H member 2 (hERG) Voltage-gated potassium channel subunit Kv11.1 hERG Potassium Channel 1 | putative potassium channel subunit
Type:
Multi-pass membrane protein
Mol. Mass.:
126672.65
Organism:
Homo sapiens (Human)
Description:
Q12809
Residue:
1159
  
Inhibitor
Name:
BDBM50411396
Synonyms:
CHEMBL244278
Type:
Small organic molecule
Emp. Form.:
C26H28ClN5OS
Mol. Mass.:
494.051
SMILES:
Cc1cc(no1)-c1ccc2CCN(CCCSc3nnc(-c4cccc(Cl)c4)n3C)CCc2c1
: