Target
Polyunsaturated fatty acid lipoxygenase ALOX15B
Ligand
BDBM50222294
Substrate
Meas. Tech.
ChEMBL_457827 (CHEMBL924097)
IC50
>100000±n/a nM
Citation
 Vasquez-Martinez, YOhri, RVKenyon, VHolman, TRSepúlveda-Boza, S Structure-activity relationship studies of flavonoids as potent inhibitors of human platelet 12-hLO, reticulocyte 15-hLO-1, and prostate epithelial 15-hLO-2. Bioorg Med Chem 15:7408-25 (2007)  
Target
Name:
Polyunsaturated fatty acid lipoxygenase ALOX15B
Synonyms:
15-LOX-2 15-Lipoxygenase-2 (15-LOX-2) ALOX15B Arachidonate 15-lipoxygenase, type II Epithelial 15-lipoxygenase-2 | LX15B_HUMAN
Type:
Protein
Mol. Mass.:
75850.40
Organism:
Homo sapiens (Human)
Description:
Residue:
676
  
Inhibitor
Name:
BDBM50222294
Synonyms:
6,7-dihydroxy-3',4'-methylenedioxyisoflavone | CHEMBL239030
Type:
Small organic molecule
Emp. Form.:
C16H10O6
Mol. Mass.:
298.247
SMILES:
Oc1cc2occ(-c3ccc4OCOc4c3)c(=O)c2cc1O
: