Target
Receptor tyrosine-protein kinase erbB-2
Ligand
BDBM50222491
Substrate
Meas. Tech.
ChEMBL_457883 (CHEMBL924155)
IC50
4±n/a nM
Citation
 Ballard, PBarlaam, BCBradbury, RHDishington, AHennequin, LFHickinson, DMHollingsworth, IMKettle, JGKlinowska, TOgilvie, DJPearson, SEScott, JSSuleman, AWhittaker, RWilliams, EJWood, RWright, L Neutral 5-substituted 4-anilinoquinazolines as potent, orally active inhibitors of erbB2 receptor tyrosine kinase. Bioorg Med Chem Lett 17:6326-9 (2007)  
Target
Name:
Receptor tyrosine-protein kinase erbB-2
Synonyms:
2.7.10.1 CD_antigen=CD340 ERBB2_HUMAN FASN/HER2 HER2 MLN19 NEU Proto-oncogene Neu Tyrosine kinase-type cell surface receptor HER2 | p185erbB2
Type:
Mol. Mass.:
137894.47
Organism:
Homo sapiens (Human)
Description:
P04626
Residue:
1255
  
Inhibitor
Name:
BDBM50222491
Synonyms:
CHEMBL249928 | N-(2-(4-(3-chloro-4-(pyridin-2-ylmethoxy)phenylamino)quinazolin-5-yloxy)ethyl)-2-hydroxy-N-methylacetamide
Type:
Small organic molecule
Emp. Form.:
C25H24ClN5O4
Mol. Mass.:
493.942
SMILES:
CN(CCOc1cccc2ncnc(Nc3ccc(OCc4ccccn4)c(Cl)c3)c12)C(=O)CO
: