Target
Vascular endothelial growth factor receptor 2
Ligand
BDBM50222509
Substrate
Meas. Tech.
ChEMBL_457938 (CHEMBL925260)
Ki
8±n/a nM
Citation
 Dominguez, CSmith, LHuang, QYuan, COuyang, XCai, LChen, PKim, JHarvey, TSyed, RKim, TSTasker, AWang, LZhang, MCoxon, ABready, JStarnes, CChen, DGan, YNeervannan, SKumar, GPolverino, AKendall, R Discovery of N-phenyl nicotinamides as potent inhibitors of Kdr. Bioorg Med Chem Lett 17:6003-8 (2007)  
Target
Name:
Vascular endothelial growth factor receptor 2
Synonyms:
CD_antigen=CD309 Fetal liver kinase 1 (FLK-1) KDR Protein-tyrosine kinase receptor Flk-1 VEGFR-2 VEGFR2 Vascular Endothelial Growth Factor Receptor Kinase 2 Vascular endothelial growth factor receptor 2 (KDR) Vascular endothelial growth factor receptor 2 (VEGFR2) Vascular endothelial growth factor receptor-2 (VEGFR-2)
Type:
Receptor Tyrosine Kinase
Mol. Mass.:
151510.97
Organism:
Homo sapiens (Human)
Description:
P35968
Residue:
1356
  
Inhibitor
Name:
BDBM50222509
Synonyms:
CHEMBL250228 | N-(4-chlorophenyl)-2-(pyridin-4-ylmethylamino)nicotinamide
Type:
Small organic molecule
Emp. Form.:
C18H15ClN4O
Mol. Mass.:
338.791
SMILES:
Clc1ccc(NC(=O)c2cccnc2NCc2ccncc2)cc1
: