Target
Aldo-keto reductase family 1 member B1
Ligand
BDBM50222610
Substrate
Meas. Tech.
ChEMBL_457959 (CHEMBL924228)
IC50
176±n/a nM
Citation
 Ferrari, AMDegliesposti, GSgobba, MRastelli, G Validation of an automated procedure for the prediction of relative free energies of binding on a set of aldose reductase inhibitors. Bioorg Med Chem 15:7865-77 (2007)  
Target
Name:
Aldo-keto reductase family 1 member B1
Synonyms:
AKR1B1 ALDR_HUMAN AR Aldose Reductase (ALR2) Aldose reductase (AR)
Type:
Protein
Mol. Mass.:
35855.50
Organism:
Homo sapiens (Human)
Description:
P15121. 4LAU; 2IKI; 4LB4; 2FZD; 2FZ8; 1US0
Residue:
316
  
Inhibitor
Name:
BDBM50222610
Synonyms:
2-(2-((4-bromo-2-fluorobenzyl)carbamoyl)phenoxy)acetic acid | CHEMBL241572
Type:
Small organic molecule
Emp. Form.:
C16H13BrFNO4
Mol. Mass.:
382.181
SMILES:
OC(=O)COc1ccccc1C(=O)NCc1ccc(Br)cc1F
: