Target
Aldo-keto reductase family 1 member B1
Ligand
BDBM50009777
Substrate
Meas. Tech.
ChEMBL_457959 (CHEMBL924228)
IC50
56.5±n/a nM
Citation
 Ferrari, AMDegliesposti, GSgobba, MRastelli, G Validation of an automated procedure for the prediction of relative free energies of binding on a set of aldose reductase inhibitors. Bioorg Med Chem 15:7865-77 (2007)  
Target
Name:
Aldo-keto reductase family 1 member B1
Synonyms:
AKR1B1 ALDR_HUMAN AR Aldose Reductase (ALR2) Aldose reductase (AR)
Type:
Protein
Mol. Mass.:
35855.50
Organism:
Homo sapiens (Human)
Description:
P15121. 4LAU; 2IKI; 4LB4; 2FZD; 2FZ8; 1US0
Residue:
316
  
Inhibitor
Name:
BDBM50009777
Synonyms:
(ponalrestat)[3-(4-Bromo-2-fluoro-benzyl)-4-oxo-3,4-dihydro-phthalazin-1-yl]-acetic acid Ponalrestat [3-(4-Bromo-2-fluoro-benzyl)-4-oxo-3,4-dihydro-phthalazin-1-yl]-acetic acid | [3-(4-Bromo-2-fluoro-benzyl)-4-oxo-3,4-dihydro-phthalazin-1-yl]-acetic acid(ponalrestat)
Type:
Small organic molecule
Emp. Form.:
C17H12BrFN2O3
Mol. Mass.:
391.191
SMILES:
OC(=O)Cc1nn(Cc2ccc(Br)cc2F)c(=O)c2ccccc12
: