Target
Aldo-keto reductase family 1 member B1
Ligand
BDBM16457
Substrate
Meas. Tech.
ChEMBL_457959 (CHEMBL924228)
IC50
25±n/a nM
Citation
 Ferrari, AMDegliesposti, GSgobba, MRastelli, G Validation of an automated procedure for the prediction of relative free energies of binding on a set of aldose reductase inhibitors. Bioorg Med Chem 15:7865-77 (2007)  
Target
Name:
Aldo-keto reductase family 1 member B1
Synonyms:
AKR1B1 ALDR_HUMAN AR Aldose Reductase (ALR2) Aldose reductase (AR)
Type:
Protein
Mol. Mass.:
35855.50
Organism:
Homo sapiens (Human)
Description:
P15121. 4LAU; 2IKI; 4LB4; 2FZD; 2FZ8; 1US0
Residue:
316
  
Inhibitor
Name:
BDBM16457
Synonyms:
6-[(5-chloro-1-benzofuran-2-)sulfonyl]-2,3-dihydropyridazin-3-one Heterocyclic Sulfonylpyridazinone, 19i | benzofuran, 23
Type:
Small organic molecule
Emp. Form.:
C12H7ClN2O4S
Mol. Mass.:
310.713
SMILES:
Clc1ccc2oc(cc2c1)S(=O)(=O)c1ccc(=O)[nH]n1
: