Target
Macrophage colony-stimulating factor 1 receptor
Ligand
BDBM50223680
Substrate
Meas. Tech.
ChEMBL_458218 (CHEMBL925553)
IC50
34±n/a nM
Citation
 Patch, RJBrandt, BMAsgari, DBaindur, NChadha, NKGeorgiadis, TCheung, WSPetrounia, IPDonatelli, RRChaikin, MAPlayer, MR Potent 2'-aminoanilide inhibitors of cFMS as potential anti-inflammatory agents. Bioorg Med Chem Lett 17:6070-4 (2007)  
Target
Name:
Macrophage colony-stimulating factor 1 receptor
Synonyms:
CSF1R FMS Macrophage colony stimulating factor receptor Macrophage colony-stimulating factor 1 receptor (c-FMS) Proto-oncogene c-Fms c-fms | cFMS
Type:
Protein
Mol. Mass.:
107979.48
Organism:
Homo sapiens (Human)
Description:
P07333
Residue:
972
  
Inhibitor
Name:
BDBM50223680
Synonyms:
5-cyano-furan-2-carboxylic acid (5-guanidinomethyl-2-piperidin-1-yl-phenyl)-amide | CHEMBL400753
Type:
Small organic molecule
Emp. Form.:
C19H22N6O2
Mol. Mass.:
366.417
SMILES:
[#7]\[#6](-[#7])=[#7]\[#6]-c1ccc(-[#7]-2-[#6]-[#6]-[#6]-[#6]-[#6]-2)c(-[#7]-[#6](=O)-c2ccc(o2)C#N)c1
: