Target
Macrophage colony-stimulating factor 1 receptor
Ligand
BDBM50223700
Substrate
Meas. Tech.
ChEMBL_458218 (CHEMBL925553)
IC50
25±n/a nM
Citation
 Patch, RJBrandt, BMAsgari, DBaindur, NChadha, NKGeorgiadis, TCheung, WSPetrounia, IPDonatelli, RRChaikin, MAPlayer, MR Potent 2'-aminoanilide inhibitors of cFMS as potential anti-inflammatory agents. Bioorg Med Chem Lett 17:6070-4 (2007)  
Target
Name:
Macrophage colony-stimulating factor 1 receptor
Synonyms:
CSF1R FMS Macrophage colony stimulating factor receptor Macrophage colony-stimulating factor 1 receptor (c-FMS) Proto-oncogene c-Fms c-fms | cFMS
Type:
Protein
Mol. Mass.:
107979.48
Organism:
Homo sapiens (Human)
Description:
P07333
Residue:
972
  
Inhibitor
Name:
BDBM50223700
Synonyms:
5-cyano-N-(5-(hydroxymethyl)-2-(piperidin-1-yl)phenyl)furan-2-carboxamide | CHEMBL399542
Type:
Small organic molecule
Emp. Form.:
C18H19N3O3
Mol. Mass.:
325.3618
SMILES:
OCc1ccc(N2CCCCC2)c(NC(=O)c2ccc(o2)C#N)c1
: