Target
Prothrombin
Ligand
BDBM12676
Substrate
Meas. Tech.
ChEMBL_458334 (CHEMBL941668)
Ki
>6300±n/a nM
Citation
 Varnes, JGWacker, DAJacobson, ICQuan, MLEllis, CDRossi, KAHe, MYLuettgen, JMKnabb, RMBai, SHe, KLam, PYWexler, RR Design, structure-activity relationship, and pharmacokinetic profile of pyrazole-based indoline factor Xa inhibitors. Bioorg Med Chem Lett 17:6481-8 (2007)  
Target
Name:
Prothrombin
Synonyms:
Activation peptide fragment 1 Coagulation factor II Prothrombin precursor Thrombin heavy chain | Thrombin light chain
Type:
Protein
Mol. Mass.:
70029.57
Organism:
Homo sapiens (Human)
Description:
P00734
Residue:
622
  
Inhibitor
Name:
BDBM12676
Synonyms:
1-(3-Aminobenzisoxazol-5-yl)-3-trifluoromethyl-N-[2-fluoro-4-[(2-dimethylaminomethyl)imidazol-1-yl]phenyl]-1H-pyrazole-5-carboxyamide Hydrochloride Salt BMS-561389 CHEMBL558198 Razaxaban
Type:
Small organic molecule
Emp. Form.:
C24H20F4N8O2
Mol. Mass.:
528.4616
SMILES:
CN(C)Cc1nccn1-c1ccc(NC(=O)c2cc(nn2-c2ccc3onc(N)c3c2)C(F)(F)F)c(F)c1
: