Target
Carboxypeptidase N catalytic chain
Ligand
BDBM50226600
Substrate
Meas. Tech.
ChEMBL_452078 (CHEMBL901239)
Ki
>10000±n/a nM
Citation
 Bunnage, MEBlagg, JSteele, JOwen, DRAllerton, CMcElroy, ABMiller, DRinger, TButcher, KBeaumont, KEvans, KGray, AJHolland, SJFeeder, NMoore, RSBrown, DG Discovery of potent& selective inhibitors of activated thrombin-activatable fibrinolysis inhibitor for the treatment of thrombosis. J Med Chem 50:6095-103 (2007)  
Target
Name:
Carboxypeptidase N catalytic chain
Synonyms:
ACBP Arginine carboxypeptidase CPN Carboxypeptidase N catalytic chain Carboxypeptidase N small subunit Kininase-1 Plasma carboxypeptidase B Serum carboxypeptidase N
Type:
PROTEIN
Mol. Mass.:
52293.66
Organism:
Homo sapiens (Human)
Description:
ChEMBL_1496379
Residue:
458
  
Inhibitor
Name:
BDBM50226600
Synonyms:
(2S)-2-[(2-aminoethyl)amino]-3-(1H-imidazol-4-yl)propanoic acid | CHEMBL235697
Type:
Small organic molecule
Emp. Form.:
C8H14N4O2
Mol. Mass.:
198.2224
SMILES:
NCCN[C@@H](Cc1cnc[nH]1)C(O)=O
: