Target
Carboxypeptidase B2
Ligand
BDBM50201438
Substrate
Meas. Tech.
ChEMBL_452077 (CHEMBL901238)
Ki
4±n/a nM
Citation
 Bunnage, MEBlagg, JSteele, JOwen, DRAllerton, CMcElroy, ABMiller, DRinger, TButcher, KBeaumont, KEvans, KGray, AJHolland, SJFeeder, NMoore, RSBrown, DG Discovery of potent& selective inhibitors of activated thrombin-activatable fibrinolysis inhibitor for the treatment of thrombosis. J Med Chem 50:6095-103 (2007)  
Target
Name:
Carboxypeptidase B2
Synonyms:
CBPB2_HUMAN CPU Carboxypeptidase B2 isoform A Plasma carboxypeptidase B Thrombin-activable fibrinolysis inhibitor | pCPB
Type:
Enzyme
Mol. Mass.:
48432.74
Organism:
Homo sapiens (Human)
Description:
Q96IY4
Residue:
423
  
Inhibitor
Name:
BDBM50201438
Synonyms:
(+/-)-5-guanidino-2-(mercaptomethyl)pentanoic acid CHEMBL236822
Type:
Small organic molecule
Emp. Form.:
C7H15N3O2S
Mol. Mass.:
205.278
SMILES:
[#7]\[#6](-[#7])=[#7]\[#6]-[#6]-[#6]-[#6](-[#6]-[#16])-[#6](-[#8])=O
: