Target
Phenylethanolamine N-methyltransferase
Ligand
BDBM50072989
Substrate
Meas. Tech.
ChEMBL_461584 (CHEMBL927607)
Ki
1500±n/a nM
Citation
 Grunewald, GLSeim, MRBhat, SRWilson, MECriscione, KR Synthesis of 4,5,6,7-tetrahydrothieno[3,2-c]pyridines and comparison with their isosteric 1,2,3,4-tetrahydroisoquinolines as inhibitors of phenylethanolamine N-methyltransferase. Bioorg Med Chem 16:542-59 (2008)  
Target
Name:
Phenylethanolamine N-methyltransferase
Synonyms:
Noradrenaline N-methyltransferase PNMT_BOVIN | PNMTase
Type:
Enzyme
Mol. Mass.:
30916.97
Organism:
Bos taurus (bovine)
Description:
Residue:
283
  
Inhibitor
Name:
BDBM50072989
Synonyms:
1,2,3,4-Tetrahydro-isoquinoline-7-carbonitrile CHEMBL27162
Type:
Small organic molecule
Emp. Form.:
C10H10N2
Mol. Mass.:
158.1998
SMILES:
N#Cc1ccc2CCNCc2c1
: