Target
Phenylethanolamine N-methyltransferase
Ligand
BDBM50227512
Substrate
Meas. Tech.
ChEMBL_461583 (CHEMBL927606)
Ki
2600±n/a nM
Citation
 Grunewald, GLSeim, MRBhat, SRWilson, MECriscione, KR Synthesis of 4,5,6,7-tetrahydrothieno[3,2-c]pyridines and comparison with their isosteric 1,2,3,4-tetrahydroisoquinolines as inhibitors of phenylethanolamine N-methyltransferase. Bioorg Med Chem 16:542-59 (2008)  
Target
Name:
Phenylethanolamine N-methyltransferase
Synonyms:
Noradrenaline N-methyltransferase PNMT PNMTase | Phenylethanolamine N-Methyltransferase (PNMT)
Type:
Enzyme
Mol. Mass.:
30852.66
Organism:
Homo sapiens (Human)
Description:
Residue:
282
  
Inhibitor
Name:
BDBM50227512
Synonyms:
2-nitro-3a,4,5,6,7,7a-hexahydrothieno[3,2-c]pyridine | CHEMBL253860
Type:
Small organic molecule
Emp. Form.:
C7H10N2O2S
Mol. Mass.:
186.232
SMILES:
[O-][N+](=O)C1=CC2CNCCC2S1
: