Target
Disintegrin and metalloproteinase domain-containing protein 10
Ligand
BDBM50227991
Substrate
Meas. Tech.
ChEMBL_461663 (CHEMBL927684)
IC50
15±n/a nM
Citation
 Yao, WZhuo, JBurns, DMLi, YLQian, DQZhang, CHe, CXu, MShi, ELi, YMarando, CACovington, MBYang, GLiu, XPan, MFridman, JSScherle, PWasserman, ZRHollis, GVaddi, KYeleswaram, SNewton, RFriedman, SMetcalf, B Design and identification of selective HER-2 sheddase inhibitors via P1' manipulation and unconventional P2' perturbations to induce a molecular metamorphosis. Bioorg Med Chem Lett 18:159-63 (2008)  
Target
Name:
Disintegrin and metalloproteinase domain-containing protein 10
Synonyms:
ADA10_HUMAN Disintegrin and metalloproteinase domain-containing protein 10 (ADAM10) MADM
Type:
Enzyme
Mol. Mass.:
84160.93
Organism:
Homo sapiens (Human)
Description:
O14672
Residue:
748
  
Inhibitor
Name:
BDBM50227991
Synonyms:
(6S,7S)-6-[4-(3,5-difluoro-phenyl)-3,6-dihydro-2H-pyridine-1-carbonyl]-5-aza-spiro[2.5]octane-7-carboxylic acid hydroxyamide | CHEMBL253920
Type:
Small organic molecule
Emp. Form.:
C20H23F2N3O3
Mol. Mass.:
391.4117
SMILES:
ONC(=O)[C@H]1CC2(CC2)CN[C@@H]1C(=O)N1CCC(=CC1)c1cc(F)cc(F)c1
: