Target
Inosine-5'-monophosphate dehydrogenase 2
Ligand
BDBM50228083
Substrate
Meas. Tech.
ChEMBL_452398 (CHEMBL902634)
Ki
540±n/a nM
Citation
 Chen, LWilson, DJayaram, HNPankiewicz, KW Dual inhibitors of inosine monophosphate dehydrogenase and histone deacetylases for cancer treatment. J Med Chem 50:6685-91 (2007)  
Target
Name:
Inosine-5'-monophosphate dehydrogenase 2
Synonyms:
IMDH2_HUMAN IMPD 2 IMPDH-II Inosine 5'-monophosphate dehydrogenase II (IMPDH II) Inosine-5 -monophosphate dehydrogenase 2 | Inosine-5'-monophosphate dehydrogenase (IMPDH)
Type:
Enzyme
Mol. Mass.:
55806.87
Organism:
Homo sapiens (Human)
Description:
Recombinant IMPDH2 expressed in E. coli.
Residue:
514
  
Inhibitor
Name:
BDBM50228083
Synonyms:
CHEMBL238905 | N-hydroxy-6-(4-hydroxy-6-methoxy-7-methyl-3-oxo-1,3-dihydroisobenzofuran-5-yl)-4-methylhexanamide
Type:
Small organic molecule
Emp. Form.:
C17H23NO6
Mol. Mass.:
337.3676
SMILES:
COc1c(C)c2COC(=O)c2c(O)c1CCC(C)CCC(=O)NO
: