Target
Sodium-dependent noradrenaline transporter
Ligand
BDBM50228441
Substrate
Meas. Tech.
ChEMBL_452612 (CHEMBL902863)
Ki
56±n/a nM
Citation
 Parhi, AKWang, JLOya, SChoi, SRKung, MPKung, HF 2-(2'-((dimethylamino)methyl)-4'-(fluoroalkoxy)-phenylthio)benzenamine derivatives as serotonin transporter imaging agents. J Med Chem 50:6673-84 (2007)  
Target
Name:
Sodium-dependent noradrenaline transporter
Synonyms:
Monoamine transporter NET Noradrenaline Transporter (NET) Norepinephrine transporter protein (NET) SLC6A2 Sodium-dependent noradrenaline transporter (NET) | Solute carrier family 6 member 2
Type:
Multi-pass membrane protein
Mol. Mass.:
69337.72
Organism:
Homo sapiens (Human)
Description:
P23975
Residue:
617
  
Inhibitor
Name:
BDBM50228441
Synonyms:
2-(4-(2-amino-4-fluoro-phenylthio)-3-((dimethylamino)methyl)phenoxy)ethanol | CHEMBL241646
Type:
Small organic molecule
Emp. Form.:
C17H21FN2O2S
Mol. Mass.:
336.424
SMILES:
CN(C)Cc1cc(OCCO)ccc1Sc1ccc(F)cc1N
: