Target
Sodium-dependent dopamine transporter
Ligand
BDBM50228441
Substrate
Meas. Tech.
ChEMBL_452610 (CHEMBL902861)
Ki
>1000±n/a nM
Citation
 Parhi, AKWang, JLOya, SChoi, SRKung, MPKung, HF 2-(2'-((dimethylamino)methyl)-4'-(fluoroalkoxy)-phenylthio)benzenamine derivatives as serotonin transporter imaging agents. J Med Chem 50:6673-84 (2007)  
Target
Name:
Sodium-dependent dopamine transporter
Synonyms:
DA transporter DAT1 Dopamine transporter protein (DAT) SC6A3_HUMAN Sodium-dependent dopamine transporter Solute carrier family 6 member 3
Type:
Multi-pass membrane protein
Mol. Mass.:
68497.11
Organism:
Homo sapiens (Human)
Description:
Q01959
Residue:
620
  
Inhibitor
Name:
BDBM50228441
Synonyms:
2-(4-(2-amino-4-fluoro-phenylthio)-3-((dimethylamino)methyl)phenoxy)ethanol | CHEMBL241646
Type:
Small organic molecule
Emp. Form.:
C17H21FN2O2S
Mol. Mass.:
336.424
SMILES:
CN(C)Cc1cc(OCCO)ccc1Sc1ccc(F)cc1N
: