Target
Sodium-dependent noradrenaline transporter
Ligand
BDBM50228437
Substrate
Meas. Tech.
ChEMBL_452612 (CHEMBL902863)
Ki
7.5±n/a nM
Citation
 Parhi, AKWang, JLOya, SChoi, SRKung, MPKung, HF 2-(2'-((dimethylamino)methyl)-4'-(fluoroalkoxy)-phenylthio)benzenamine derivatives as serotonin transporter imaging agents. J Med Chem 50:6673-84 (2007)  
Target
Name:
Sodium-dependent noradrenaline transporter
Synonyms:
Monoamine transporter NET Noradrenaline Transporter (NET) Norepinephrine transporter protein (NET) SLC6A2 Sodium-dependent noradrenaline transporter (NET) | Solute carrier family 6 member 2
Type:
Multi-pass membrane protein
Mol. Mass.:
69337.72
Organism:
Homo sapiens (Human)
Description:
P23975
Residue:
617
  
Inhibitor
Name:
BDBM50228437
Synonyms:
2-(2-((dimethylamino)methyl)-4-(2-fluoroethoxy)phenylthio)-benzenamine | CHEMBL238867
Type:
Small organic molecule
Emp. Form.:
C17H21FN2OS
Mol. Mass.:
320.425
SMILES:
CN(C)Cc1cc(OCCF)ccc1Sc1ccccc1N
: